Breaking News: Grepper is joining You.com. Read the official announcement!
Check it out

Module build failed (from ./node_modules/sass-loader/dist/cjs.js): SassError: Can't find stylesheet to import. ╷ 4 │ @import '~@fortawesome/fontawesome-free/scss/fontawesome.scss';

Mrhili answered on May 11, 2023 Popularity 5/10 Helpfulness 1/10

Contents


More Related Answers

  • can't resolve 'sass-loader' vue
  • Preprocessor dependency "sass" not found. Did you install it?
  • cannot find module 'sass' react
  • error /node_modules/node-sass: Command failed
  • ModuleBuildError: Module build failed (from ./node_modules/sass-loader/lib/loader.js): Error: ENOENT: no such file or directory, scandir
  • node-sass: command not found
  • modulebuilderror: module build failed (from ./node_modules/sass-loader/lib/loader.js):
  • Module Error (from ./node_modules/sass-loader/dist/cjs.js): Cannot find module 'sass'
  • node sass install error
  • failed to resolve loader sass-loader vue 3
  • Module Error (from ./node_modules/sass-loader/dist/cjs.js): Node Sass version 6.0.0 is incompatible with ^4.0.0 || ^5.0.0.
  • npm ERR! path node_modules/node-sass
  • Error: Cannot find module 'node-sass'
  • Cannot find module 'node-sass'
  • install sass loader
  • npm ERR! node-sass@4.13.1 postinstall: `node scripts/build.js`
  • Module Error (from ./node_modules/sass-loader/dist/cjs.js):
  • cannot load such file -- sass-listen
  • ./src/styles.scss - Error: Module build failed (from ./node_modules/postcss-loader/dist/cjs.js): SyntaxError: Unexpected token, expected "," (5:5) ./src/app/app.component.scss?ngResource - Error: Module build failed (from ./node_modules/postcss-loader/dis
  • module build failed (from ./node_modules/css-loader/dist/cjs.js):
  • error when i install sass
  • to import sass files you first need to install node-sass. react
  • Error: Cannot find module 'node-sass'
  • node sass error
  • npm ERR! code 1 npm ERR! path C:\Users\Administrator\Desktop\Dev\masterPortfolio\node_modules\node-sass
  • Module build failed (from ./node_modules/css-loader/dist/cjs.js):
  • node-sass error node_modules\node-sass: Command failed.
  • Module build failed: Error: Cannot find module 'node-sass'
  • gulp import sass
  • error in ./resources/sass/app.scss

  • Module build failed (from ./node_modules/sass-loader/dist/cjs.js): SassError: Can't find stylesheet to import. ╷ 4 │ @import '~@fortawesome/fontawesome-free/scss/fontawesome.scss';

    0

    For Angular 15. remove tilde symbol (~) from the path. 

    Popularity 5/10 Helpfulness 1/10 Language whatever
    Source: Grepper
    Link to this answer
    Share Copy Link
    Contributed on May 11 2023
    Mrhili
    0 Answers  Avg Quality 2/10


    X

    Continue with Google

    By continuing, I agree that I have read and agree to Greppers's Terms of Service and Privacy Policy.
    X
    Grepper Account Login Required

    Oops, You will need to install Grepper and log-in to perform this action.